{"text_format":"1","workbook":"xlsx","n_sheets":14,"sheets":["Instructions","Financial Summary","Scenarios","Input >>>","Benefits","Project Estimate (Non-IT)","Project Estimate (IT)","Ongoing Costs","Risks","References >>>","Appendix >>>","Definitions","Salary Rates and Tables","Assumptions"],"not_rendered":{"charts":0,"images":1,"macros":1,"external_links":1,"defined_names":14,"comments":2,"pivot_tables":0},"unopened":[],"bounds":{"document_bytes":16777216,"sheet_cells":100000,"rows_first":2000,"rows_last":500,"rows_between":2000,"halvings":0,"cell_chars":16384,"cell_head_chars":4096},"cells_cut":0,"cells_raw":0,"read":"whole","date_system":"1900"}

{"sheet":"Instructions","index":0,"n_rows":40,"n_cols":1,"rows_kept":40,"cut":false,"hidden":false,"merged":[]}
["PROJECT FINANCIAL MODEL"]
[]
["WHEN TO USE THIS?"]
["The financial model is designed for all academic, business and IT projects. This covers all other projects except for the ones listed below:"]
["* Properties & Facilities - They have their own industry-specific models."]
["* Research projects (DVC R&E portfolio) - They use a different funding model."]
["* Curriculum development projects - Use ACU Excel Course Concept Business Case model"]
[]
{"$rows_left_out":33}
{"sheet":"Financial Summary","index":1,"n_rows":42,"n_cols":15,"rows_kept":42,"cut":false,"hidden":false,"merged":[[10,4,10,5],[8,4,8,5],[2,13,2,14],[4,3,4,5],[5,3,5,5],[6,3,6,5],[9,4,9,5]]}
[]
[null,null,null,null,null,null,null,"FINANCIAL SUMMARY OF A PROJECT"]
[null,null,null,null,null,null,null,{"$f":"Project_name","v":"XYZ Project"},null,null,null,null,"Model Check",{"$f":"IF(ROUND((SUM(Scenarios!D94:Z94)+SUM(Scenarios!D101:Z101)+SUM(D15:D16)-SUM(I35:I36)),0)=0,\"OK\",\"Error in Model\")","v":"OK"}]
[]
[null,"EXECUTIVE SPONSOR",null,"Paul Campbell",null,null,null,"Pre-Project start","2024-10-01"]
[null,"PROJECT NAME",null,"XYZ Project",null,null,null,"Project start","2024-05-01"]
[null,"PROJECT ID",null,"90xxxx",null,null,null,"Go-Live / operations start","2025-02-01"]
[null,null,null,null,null,null,null,"Project closure","2026-06-30"]
{"$rows_left_out":35}
{"sheet":"Scenarios","index":2,"n_rows":101,"n_cols":26,"rows_kept":101,"cut":false,"hidden":false,"merged":[[5,19,6,19],[5,3,6,3],[5,11,6,11]]}
[]
[null,null,null,null,null,null,"FINANCIAL RESULT",null,null,null,null,null,null,null,{"$f":"G2","v":"FINANCIAL RESULT"},null,null,null,null,null,null,null,{"$f":"G2","v":"FINANCIAL RESULT"}]
[null,null,null,null,null,null,{"$f":"Project_name","v":"XYZ Project"},null,null,null,null,null,null,null,{"$f":"G3","v":"XYZ Project"},null,null,null,null,null,null,null,{"$f":"G3","v":"XYZ Project"}]
[]
[null,null,null,null,null,null,"Best case scenario (\"optimistic\")",null,null,null,null,null,null,null,"Projected case scenario (\"mid-point\")",null,null,null,null,null,null,null,"Worst case scenario (\"pessimistic\")"]
[null,null,null,"TOTAL",{"$f":"Assumptions!D19","v":"Pre Project"},{"$f":"Assumptions!E19","v":"Year 1"},{"$f":"Assumptions!F19","v":"Year 2"},{"$f":"Assumptions!G19","v":"Year 3"},{"$f":"Assumptions!H19","v":"Year 4"},{"$f":"Assumptions!I19","v":"Year 5"},null,"TOTAL",{"$f":"Assumptions!D19","v":"Pre Project"},{"$f":"Assumptions!E19","v":"Year 1"},{"$f":"Assumptions!F19","v":"Year 2"},{"$f":"Assumptions!G19","v":"Year 3"},{"$f":"Assumptions!H19","v":"Year 4"},{"$f":"Assumptions!I19","v":"Year 5"},null,"TOTAL",{"$f":"Assumptions!D19","v":"Pre Project"},{"$f":"Assumptions!E19","v":"Year 1"},{"$f":"Assumptions!F19","v":"Year 2"},{"$f":"Assumptions!G19","v":"Year 3"},{"$f":"Assumptions!H19","v":"Year 4"},{"$f":"Assumptions!I19","v":"Year 5"}]
[null,null,null,null,{"$f":"Assumptions!D20","v":2024},{"$f":"Assumptions!E20","v":2024},{"$f":"Assumptions!F20","v":2025},{"$f":"Assumptions!G20","v":2026},{"$f":"Assumptions!H20","v":2027},{"$f":"Assumptions!I20","v":2028},null,null,{"$f":"Assumptions!D20","v":2024},{"$f":"Assumptions!E20","v":2024},{"$f":"Assumptions!F20","v":2025},{"$f":"Assumptions!G20","v":2026},{"$f":"Assumptions!H20","v":2027},{"$f":"Assumptions!I20","v":2028},null,null,{"$f":"Assumptions!D20","v":2024},{"$f":"Assumptions!E20","v":2024},{"$f":"Assumptions!F20","v":2025},{"$f":"Assumptions!G20","v":2026},{"$f":"Assumptions!H20","v":2027},{"$f":"Assumptions!I20","v":2028}]
[null,"BENEFITS"]
{"$rows_left_out":94}
{"sheet":"Input >>>","index":3,"n_rows":0,"n_cols":0,"rows_kept":0,"cut":false,"hidden":true,"merged":[]}

{"sheet":"Benefits","index":4,"n_rows":31,"n_cols":17,"rows_kept":31,"cut":false,"hidden":false,"merged":[[1,10,2,10]]}
[]
[null,null,null,"FINANCIAL BENEFITS",null,null,null,null,null,null,"TOTAL",{"$f":"Scenarios!E6","v":"Pre Project"},{"$f":"Scenarios!F6","v":"Year 1"},{"$f":"Scenarios!G6","v":"Year 2"},{"$f":"Scenarios!H6","v":"Year 3"},{"$f":"Scenarios!I6","v":"Year 4"},{"$f":"Scenarios!J6","v":"Year 5"}]
[null,null,null,{"$f":"Project_name","v":"XYZ Project"},null,null,null,null,null,null,null,{"$f":"Scenarios!E7","v":2024},{"$f":"Scenarios!F7","v":2024},{"$f":"Scenarios!G7","v":2025},{"$f":"Scenarios!H7","v":2026},{"$f":"Scenarios!I7","v":2027},{"$f":"Scenarios!J7","v":2028}]
[]
[null,"Output - Expected benefits for the project"]
[]
[null,"Item","Benefit Class","Benefit",null,null,null,null,null,null,"Total",{"$f":"Assumptions!D$19","v":"Pre Project"},{"$f":"Assumptions!E$19","v":"Year 1"},{"$f":"Assumptions!F$19","v":"Year 2"},{"$f":"Assumptions!G$19","v":"Year 3"},{"$f":"Assumptions!H$19","v":"Year 4"},{"$f":"Assumptions!I$19","v":"Year 5"}]
[null,"#","[Choose from the drop down list]","[Benefit title as per the Benefit Realisation Plan]"]
{"$rows_left_out":24}
{"sheet":"Project Estimate (Non-IT)","index":5,"n_rows":131,"n_cols":29,"rows_kept":131,"cut":false,"hidden":false,"merged":[[95,23,95,28],[1,10,2,10],[1,22,2,22],[34,23,34,28],[61,23,61,28],[78,23,78,28]]}
[]
[null,null,null,null,null,"ESTIMATED PROJECT EXPENSES (non-IT components)",null,null,null,null,"TOTAL",{"$f":"Scenarios!E6","v":"Pre Project"},{"$f":"Scenarios!F6","v":"Year 1"},{"$f":"Scenarios!G6","v":"Year 2"},{"$f":"Scenarios!H6","v":"Year 3"},{"$f":"Scenarios!I6","v":"Year 4"},{"$f":"Scenarios!J6","v":"Year 5"},null,null,null,null,null,"TOTAL",{"$f":"L2","v":"Pre Project"},{"$f":"M2","v":"Year 1"},{"$f":"N2","v":"Year 2"},{"$f":"O2","v":"Year 3"},{"$f":"P2","v":"Year 4"},{"$f":"Q2","v":"Year 5"}]
[null,null,null,null,null,{"$f":"Project_name","v":"XYZ Project"},null,null,null,null,null,{"$f":"Scenarios!E7","v":2024},{"$f":"Scenarios!F7","v":2024},{"$f":"Scenarios!G7","v":2025},{"$f":"Scenarios!H7","v":2026},{"$f":"Scenarios!I7","v":2027},{"$f":"Scenarios!J7","v":2028},null,null,null,null,null,null,{"$f":"L3","v":2024},2024,2025,2026,2027,2028]
[]
[null,"OPERATIONAL STAFF"]
[]
[null,"Item","Funding Source","Directorate","Resource","Key Outputs","Existing Staff or New Hire","Salary Level","Employment Type",null,"Total",{"$f":"Assumptions!D$19","v":"Pre Project"},{"$f":"Assumptions!E$19","v":"Year 1"},{"$f":"Assumptions!F$19","v":"Year 2"},{"$f":"Assumptions!G$19","v":"Year 3"},{"$f":"Assumptions!H$19","v":"Year 4"},{"$f":"Assumptions!I$19","v":"Year 5"},null,null,null,null,null,"Total",{"$f":"L7","v":"Pre Project"},{"$f":"M7","v":"Year 1"},"Year 2","Year 3","Year 4","Year 5"]
[null,"#","[Choose from the drop down list]","[Choose from the drop down list]","[Role / position name]","[Expected outputs or contribution to project]","[Will you use existing staff or recruit for the project?]","[Choose from the drop down list]","[Choose from the drop down list]",null,null,null,null,"Input workdays per year required"]
{"$rows_left_out":124}
{"sheet":"Project Estimate (IT)","index":6,"n_rows":131,"n_cols":29,"rows_kept":131,"cut":false,"hidden":false,"merged":[[78,23,78,28],[95,23,95,28],[1,10,2,10],[1,22,2,22],[34,23,34,28],[61,23,61,28]]}
[]
[null,null,null,null,null,"ESTIMATED PROJECT EXPENSES (IT components)",null,null,null,null,"TOTAL",{"$f":"Scenarios!E6","v":"Pre Project"},{"$f":"Scenarios!F6","v":"Year 1"},{"$f":"Scenarios!G6","v":"Year 2"},{"$f":"Scenarios!H6","v":"Year 3"},{"$f":"Scenarios!I6","v":"Year 4"},{"$f":"Scenarios!J6","v":"Year 5"},null,null,null,null,null,"TOTAL",{"$f":"L2","v":"Pre Project"},{"$f":"M2","v":"Year 1"},"Year 2","Year 3","Year 4","Year 5"]
[null,null,null,null,null,{"$f":"Project_name","v":"XYZ Project"},null,null,null,null,null,{"$f":"Scenarios!E7","v":2024},{"$f":"Scenarios!F7","v":2024},{"$f":"Scenarios!G7","v":2025},{"$f":"Scenarios!H7","v":2026},{"$f":"Scenarios!I7","v":2027},{"$f":"Scenarios!J7","v":2028},null,null,null,null,null,null,{"$f":"L3","v":2024},2024,2025,2026,2027,2028]
[]
[null,"OPERATIONAL STAFF"]
[]
[null,"Item","Funding Source","Directorate","Resource","Key Outputs","Existing Staff or New Hire","Salary Level","Employment Type",null,"Total",{"$f":"Assumptions!D$19","v":"Pre Project"},{"$f":"Assumptions!E$19","v":"Year 1"},{"$f":"Assumptions!F$19","v":"Year 2"},{"$f":"Assumptions!G$19","v":"Year 3"},{"$f":"Assumptions!H$19","v":"Year 4"},{"$f":"Assumptions!I$19","v":"Year 5"},null,null,null,null,null,"Total",{"$f":"L7","v":"Pre Project"},{"$f":"M7","v":"Year 1"},"Year 2","Year 3","Year 4","Year 5"]
[null,"#","[Choose from the drop down list]","['Information Technology (IT)' by default]","[Role / position name]","[Expected outputs or contribution to project]","[Will you use existing staff or recruit for the project?]","[Choose from the drop down list]","[Choose from the drop down list]",null,null,null,null,"Input workdays per year required"]
{"$rows_left_out":124}
{"sheet":"Ongoing Costs","index":7,"n_rows":80,"n_cols":29,"rows_kept":80,"cut":false,"hidden":false,"merged":[[43,11,43,16],[43,23,43,28],[1,10,2,10],[1,22,2,22],[7,11,7,16],[25,11,25,16],[25,23,25,28]]}
[]
[null,null,null,null,null,"ONGOING OPERATIONAL AND SUPPORT COSTS",null,null,null,null,"TOTAL",{"$f":"Scenarios!E6","v":"Pre Project"},{"$f":"Scenarios!F6","v":"Year 1"},{"$f":"Scenarios!G6","v":"Year 2"},{"$f":"Scenarios!H6","v":"Year 3"},{"$f":"Scenarios!I6","v":"Year 4"},{"$f":"Scenarios!J6","v":"Year 5"},null,null,null,null,null,"TOTAL",{"$f":"L2","v":"Pre Project"},{"$f":"M2","v":"Year 1"},"Year 2","Year 3","Year 4","Year 5"]
[null,null,null,null,null,{"$f":"Project_name","v":"XYZ Project"},null,null,null,null,null,{"$f":"Scenarios!E7","v":2024},{"$f":"Scenarios!F7","v":2024},{"$f":"Scenarios!G7","v":2025},{"$f":"Scenarios!H7","v":2026},{"$f":"Scenarios!I7","v":2027},{"$f":"Scenarios!J7","v":2028},null,null,null,null,null,null,{"$f":"L3","v":2024},2024,2025,2026,2027,2028]
[]
[null,"OPERATIONAL STAFF"]
[]
[null,"Item","Funding Source","Directorate","Resource","Key Outputs","Existing Staff or New Hire","Salary Level","Employment Type",null,"Total",{"$f":"Assumptions!D$19","v":"Pre Project"},{"$f":"Assumptions!E$19","v":"Year 1"},{"$f":"Assumptions!F$19","v":"Year 2"},{"$f":"Assumptions!G$19","v":"Year 3"},{"$f":"Assumptions!H$19","v":"Year 4"},{"$f":"Assumptions!I$19","v":"Year 5"},null,null,null,null,null,"Total",{"$f":"L7","v":"Pre Project"},{"$f":"M7","v":"Year 1"},"Year 2","Year 3","Year 4","Year 5"]
[null,"#","[Choose from the drop down list]","[Choose from the drop down list]","[Role / position name]","[Expected outputs or contribution to project]","[Will you use existing staff or recruit for the project?]","[Choose from the drop down list]","[Choose from the drop down list]",null,null,"Input workdays per year required"]
{"$rows_left_out":73}
{"sheet":"Risks","index":8,"n_rows":67,"n_cols":29,"rows_kept":67,"cut":false,"hidden":false,"merged":[[43,11,43,16],[43,23,43,28],[1,10,2,10],[1,22,2,22],[25,23,25,28]]}
[]
[null,null,null,null,null,"COSTING OF RISKS",null,null,null,null,"TOTAL",{"$f":"Scenarios!E6","v":"Pre Project"},{"$f":"Scenarios!F6","v":"Year 1"},{"$f":"Scenarios!G6","v":"Year 2"},{"$f":"Scenarios!H6","v":"Year 3"},{"$f":"Scenarios!I6","v":"Year 4"},{"$f":"Scenarios!J6","v":"Year 5"},null,null,null,null,null,"TOTAL",{"$f":"L2","v":"Pre Project"},{"$f":"M2","v":"Year 1"},"Year 2","Year 3","Year 4","Year 5"]
[null,null,null,null,null,{"$f":"Project_name","v":"XYZ Project"},null,null,null,null,null,{"$f":"Scenarios!E7","v":2024},{"$f":"Scenarios!F7","v":2024},{"$f":"Scenarios!G7","v":2025},{"$f":"Scenarios!H7","v":2026},{"$f":"Scenarios!I7","v":2027},{"$f":"Scenarios!J7","v":2028},null,null,null,null,null,null,{"$f":"L3","v":2024},2024,2025,2026,2027,2028]
[]
[null,"STAFF RELATED RISKS"]
[]
[null,"Item","Funding Source","Directorate","Resource","Key Outputs","Existing Staff or New Hire","Salary Level","Employment Type",null,"Total",{"$f":"Assumptions!D$19","v":"Pre Project"},{"$f":"Assumptions!E$19","v":"Year 1"},{"$f":"Assumptions!F$19","v":"Year 2"},{"$f":"Assumptions!G$19","v":"Year 3"},{"$f":"Assumptions!H$19","v":"Year 4"},{"$f":"Assumptions!I$19","v":"Year 5"},null,null,null,null,null,"Total",{"$f":"L7","v":"Pre Project"},{"$f":"M7","v":"Year 1"},"Year 2","Year 3","Year 4","Year 5"]
[null,"#","[Choose from the drop down list]","[Choose from the drop down list]","[Role / position name]","[Expected outputs or contribution to project]","[Will you use existing staff or recruit for the project?]","[Choose from the drop down list]","[Choose from the drop down list]",null,null,null,null,"Input workdays required to control or resolve the risk"]
{"$rows_left_out":60}
{"sheet":"References >>>","index":9,"n_rows":0,"n_cols":0,"rows_kept":0,"cut":false,"hidden":true,"merged":[]}

{"sheet":"Appendix >>>","index":10,"n_rows":11,"n_cols":3,"rows_kept":11,"cut":false,"hidden":false,"merged":[]}
[]
[]
[null,null,"The worksheets after this contain values which are used as references or in calculations."]
[]
[null,null,"If any changes to them are needed, they are done by Finance."]
[null,null,"Please contact your Faculty Finance Managers or Portfolio Management Accountant."]
[null,null,"Please do not edit them yourself in any manner as they will directly influence the accuracy of this model!"]
[]
{"$rows_left_out":4}
{"sheet":"Definitions","index":11,"n_rows":30,"n_cols":3,"rows_kept":30,"cut":false,"hidden":false,"merged":[]}
[null,"DEFINITIONS USED IN THE FINANCIAL MODEL"]
[]
["TERM","DEFINITION","LINK"]
["Backfill Requirements","Resources who backfill operational (BAU) staff while the operational staff are transferred to project work.\nThey are paid through the University payroll. They can come from the University or be new hires for the duration of the project."]
["Benefit class","Financial benefits are classified into different types:\n* Increase revenue - An improvement in the ACU bottom line through increased revenue. Payback expected (benefits > project costs).\n* Reduce cost - An improvement in the ACU bottom line through reduced cost. Payback expected (benefits > project costs).\n* Repurpose - Resources are moved to other uses, along with the respective costs following efficiency gains (e.g. saved staff time).\n* Secure position - Secures revenue against loss or expenses against an increase. Maintains the ACU bottom line as is, instead of a potential or expected weakening of the position.","Benefits Management for projects"]
["Best case","The optimistic estimate where everything goes to the plan and succeeds. The initial project estimation is done using this scenario."]
["Capital funds","Funding based on the University surplus, allocated usually to physical and virtual infrastructure (e.g. facilities or new technology and business systems). All complex and most medium projects are funded from capital funds. In TechOne, funding source 322.\nAn application needs to be made to the Investment Management Committee (IMC) to access the funding.","Capital Planning Committee"]
["Consulting Packages & professional services","Specific work packages (SOW / Scope of Works) delivered by external parties on a contract (e.g. a feasibility study, design work, cyber security testing, etc). Paid through the Accounts Payable."]
{"$rows_left_out":23}
{"sheet":"Salary Rates and Tables","index":12,"n_rows":84,"n_cols":14,"rows_kept":84,"cut":false,"hidden":false,"merged":[]}
[]
[]
[]
[]
[]
[null,"SALARY RATES","PAY CLASS","SALARY RATES","3.75% increase 06/01/2024","F/N AMOUNT","HOURLY RATE","CASUAL HOURLY RATE WITH 25% LOADING","CASUAL HOURLY RATE WITH 25% LOADING (2 dec plc)",null,"Benefit types","Comment",null,"Directorates"]
[null,null,null,null,null,null,null,null,null,null,"Increase revenue","Bring new revenue to ACU",null,"Academic Registrar and Student Administration"]
[null,"Academic A, Inc 1","ACA1","Academic Level A, Increment 1",77868,2984.67,42.638190000000002,53.297739999999997,53.29,null,"Reduce cost","Lower the cost of operating",null,"ACU  Engagement"]
{"$rows_left_out":77}
{"sheet":"Assumptions","index":13,"n_rows":34,"n_cols":9,"rows_kept":34,"cut":false,"hidden":false,"merged":[]}
[]
[]
[]
[]
[]
[null,"Assumptions"]
[null,"List here any assumed values or multipliers which influence calculations."]
[null,"To change the preset values, please consult with a finance representative or PPO."]
{"$rows_left_out":26}