{"text_format":"1","workbook":"xlsx","n_sheets":6,"sheets":["Calculation Sheet","Severance payment","Notice","Salary Rate","Mapping","Tax Rates"],"not_rendered":{"charts":0,"images":1,"macros":1,"external_links":2,"defined_names":22,"comments":0,"pivot_tables":0},"unopened":[],"bounds":{"document_bytes":16777216,"sheet_cells":100000,"rows_first":2000,"rows_last":500,"rows_between":2000,"halvings":0,"cell_chars":16384,"cell_head_chars":4096},"cells_cut":0,"cells_raw":0,"read":"whole","date_system":"1900"}

{"sheet":"Calculation Sheet","index":0,"n_rows":103,"n_cols":25,"rows_kept":103,"cut":false,"hidden":false,"merged":[[106,1,106,8],[4,1,4,7],[5,1,5,7],[73,1,73,8],[74,1,74,8],[77,1,77,8],[80,1,80,8],[83,1,83,8],[86,1,86,8],[96,1,96,8],[105,1,105,8],[88,4,89,4],[90,4,91,4],[81,1,81,8],[82,1,82,8]]}
[null,"Redundancy Calculator 2023 - Redundancy Payment Estimate"]
[]
[]
[]
[null,"This calculator is designed to assist continuing staff members, who are considering submission of an expression of interest in Voluntary Redundancy, with calculation of an approximate dollar value of a redundancy payment in accordance with the provisions of the ACU Staff Enterprise Agreement 2022-2025."]
[null,"The approximate entitlement calculation contained herein is provided as an estimate only. \nYour formal redundancy calculation and separation payments, calculated by People and Capability if separation proceeds for reason of redundancy, may vary from this estimate.\nAll staff are encouraged to seek financial advice before submitting an expression of interest for voluntary redundancy."]
[]
[null,"Please select the salary plan,  input the work hours per fortnight,  the years of completed service and date of birth."]
[null,null,"Choose your salary type and classification, then enter details in the yellow cells"]
[null,"Academic / Professional/ Senior Management",null,null,{"$f":"\"AL Balance as at \"&TEXT($C$22,\"DD MMM YYYY\")","v":"AL Balance as at 00 Jan 1900"},null,null,"Hours"]
[null,"Classification",null,null,{"$f":"\"LSL Balance as at \"&TEXT($C$22,\"DD MMM YYYY\")","v":"LSL Balance as at 00 Jan 1900"},null,null,"Hours",null,null,null,null,null,null,null,null,null,null,"Marginal Tax on leave payout"]
[null,"Salary Loading % (if applicable)",null,null,"Login to Staff Connect to view your leave balances.",null,null,null,null,null,null,null,null,null,null,null,null,null,"Annual Taxable Salary",{"$f":"C36","v":0}]
[null,"Clinical Loading:",null,null,"You can use the 'Predict' function to calculate leave balances for a future date.",null,null,null,null,null,null,null,null,null,null,null,null,null,"Leave payout",{"$f":"D63","v":0}]
[null,"ELT Allowance:",null,null,null,null,null,null,null,null,null,null,null,null,null,null,null,null,"Total Annual Income",{"$f":"SUM(T12:T13)","v":0}]
[null,null,null,null,null,null,null,null,null,null,null,null,null,null,null,null,null,null,"current fortnightly Pay",{"$f":"D36","v":0}]
[null,"Annual Salary Amount",null,null,null,null,null,null,null,null,null,null,null,null,null,null,null,null,"New fortnightly income",{"$f":"T14/26.08929","v":0}]
[null,"Hours per fortnight",null,null,null,null,null,null,null,null,null,null,null,null,null,null,null,null,"New fortnightly tax",{"$f":"VLOOKUP(T16,'Tax Rates'!A:B,2,TRUE)","v":{"$error":"#N/A"}}]
[null,"Full-time hours per fortnight are 70. Your current hours per fortnight appears as \"units\" on your payslip.",null,null,null,null,null,null,null,null,null,null,null,null,null,null,null,null,"current fortnightly tax",{"$f":"VLOOKUP(T15,'Tax Rates'!A:B,2,TRUE)","v":{"$error":"#N/A"}}]
[null,null,null,null,null,null,null,null,null,null,null,null,null,null,null,null,null,null,"Fortnightly tax difference",{"$f":"T17-T18","v":{"$error":"#N/A"}}]
[null,"Date Commenced at ACU",null,null,null,null,null,null,null,null,null,null,null,null,null,null,null,null,"Tax on leave payout",{"$f":"T19*26","v":{"$error":"#N/A"}}]
[null,null,null,null,null,null,null,null,null,null,null,null,null,null,null,null,null,null,"% tax on leave payout",{"$f":"T20/T13","v":{"$error":"#N/A"}}]
[null,"Estimated Separation Date"]
[null,"This is for modelling purposes only. The actual redundancy date will be determined by the University."]
[]
[null,{"$f":"\"Years of Completed Service at \"&TEXT($C$22,\"DD MMM YYYY\")","v":"Years of Completed Service at 00 Jan 1900"},{"$f":"ROUNDDOWN(YEARFRAC(C20,C22,3),0)","v":0},null,null,null,null,null,null,null,null,null,null,null,null,null,null,null,null,null,"1952-06-30",null,65]
[null,null,null,null,null,null,null,null,null,null,null,null,null,null,null,null,null,null,null,null,"1952-07-01","1953-12-31",65.5]
[null,"Date of Birth",null,null,null,null,null,null,null,null,null,null,null,null,null,null,null,null,null,null,"1954-01-01","1955-06-30",66]
[null,{"$f":"\"Age at \"&TEXT($C$22,\"DD MMM YYYY\")","v":"Age at 00 Jan 1900"},{"$f":"IF(C27=\"\",\"\",YEARFRAC(C27,C22))","v":""},null,null,null,null,null,null,null,null,null,null,null,null,null,null,null,null,null,"1955-07-01","1956-12-31",66.5]
[null,"Age at 30 June 2024",{"$f":"IF(C27=\"\",\"\",YEARFRAC(C27,\"30/06/2024\"))","v":""}]
[null,"Reached Pension Age?",{"$f":"IF(C27=\"\",\"\",IF(AND(C27<U25,C28>W25),\"Y\",IF(AND(AND(C27>=U26,C27<=V26),C28>=W26),\"Y\",IF(AND(AND(C27>=U27,C27<=V27),C28>=W27),\"Y\",IF(AND(AND(C27>=U28,C27<=V28),C28>=W28),\"Y\",IF(AND(C27>=U30,C27<W30),\"Y\",\"N\"))))))","v":""},null,null,null,null,null,null,null,null,null,null,null,null,null,null,null,null,null,"1957-01-01",null,67]
[null,"Reached Preservation Age?",{"$f":"IF($C$27=\"\",\"\",IF(AND($C$27<=U33,$C$29>W33),\"Y\",IF(AND(AND($C$27>=U34,$C$27<=V34),$C$29>=W34),\"Y\",IF(AND(AND($C$27>=U35,$C$27<=V35),$C$29>=W35),\"Y\",IF(AND(AND($C$27>=U36,$C$27<=V36),$C$29>=W36),\"Y\",IF(AND(AND($C$27>=U37,$C$27<=V37),$C$29>=W37),\"Y\",IF(AND($C$27>=U38,$C$29>=W38),\"Y\",\"N\")))))))","v":""},{"$f":"C27","v":"00:00:00"}]
[null,null,null,{"$f":"C28","v":""}]
[null,"Salary Details","Annual","Fortnightly","Weekly","Hourly",null,null,null,null,null,null,null,null,null,null,null,null,null,null,"1960-06-30",null,55]
[null,"Salary",{"$f":"(IFERROR(IF(C10=\"Senior Management\",C16,VLOOKUP(C11,'Salary Rate'!B:D,3,FALSE))*(C17/70),\" \"))","v":" "},{"$f":"IFERROR(C34/26.08929,\"\")","v":""},{"$f":"IFERROR(D34/2,\"\")","v":""},{"$f":"IFERROR(D34/C17,\"\")","v":""},null,null,null,null,null,null,null,null,null,null,null,null,null,null,"1960-07-01","1961-06-30",56]
[null,"Salary Loading",{"$f":"IFERROR(C34*C12,\" \")","v":" "},{"$f":"IFERROR(C35/26.08929,\"\")","v":""},{"$f":"IFERROR(D35/2,\"\")","v":""},{"$f":"IFERROR(D35/C17,\" \")","v":" "},null,null,null,null,null,null,null,null,null,null,null,null,null,null,"1961-07-01","1962-06-30",57]
[null,"Current Salary",{"$f":"SUM(C34:C35)","v":0},{"$f":"SUM(D34:D35)","v":0},0,0,null,null,null,null,null,null,null,null,null,null,null,null,null,null,"1962-07-01","1963-06-30",58]
[null,null,null,null,null,null,null,null,null,null,null,null,null,null,null,null,null,null,null,null,"1963-07-01","1964-06-30",59]
[null,null,null,null,null,null,null,null,null,null,null,null,null,null,null,null,null,null,null,null,"1964-07-01",null,60]
[null,"Redundancy payment estimate"]
[null,{"$f":"\"Assuming employment end date of \"&TEXT($C$22,\"DD MMM YYYY\")","v":"Assuming employment end date of 00 Jan 1900"}]
[null,"Refer to the Estimated Entitlement section below for further information about this estimate."]
[null,"This simple calculator does not take into account any variations between the current working arrangements and a staff member's substantive working arrangements."]
[null,"Estimated Redundancy Entitlement","Weeks","Amount",null,0,null,null,null,null,null,null,null,null,null,null,null,null,null,null,"Tax Rates",null,null,null,"ETP Rates"]
[null,"Payment in Lieu of Notice",{"$f":"IF(C10=0,\" \",IF(AND(C10=\"Professional\",C25<5),MAX(3*C25,3),26))","v":" "},{"$f":"IFERROR(C44*($C$17/2)*$F$36,\" \")","v":" "},"Payment in lieu of notice is reduced by the time elapsed",null,null,null,null,null,null,null,null,null,null,null,null,null,null,null,"Under Preservation Age",null,32,null,{"$f":"IF(C31=\"Y\",17%,32%)","v":0.32}]
[null,"Severance Pay",{"$f":"IF(C10=0,\" \",IF(C10=\"Senior Management\",\" \",IF(C28<45,VLOOKUP(C25,'Severance payment'!$A$5:$B$57,2,FALSE),VLOOKUP('Calculation Sheet'!C25,'Severance payment'!$A$6:$C$57,3,FALSE))))","v":" "},{"$f":"IFERROR(C45*($C$17/2)*$F$36,\" \")","v":" "},"between your notice date and separation date",null,null,null,null,null,null,null,null,null,null,null,null,null,null,null,"On or over preservation Age",null,0.17,null,0.47]
[null,"Total weeks (capped at 78 wks)",{"$f":"IF(SUM(C44:C45)>78,78,SUM(C44:C45))","v":0},{"$f":"SUM(D44:D45)","v":0},null,null,null,null,null,null,null,null,null,null,null,null,null,null,null,null,"Over $235000"]
[]
[null,"Package Details"]
[null,"Tax free Component",null,{"$f":"IF(C30=\"N\",MIN((11985+5994*$C$25),D46),0)","v":0}]
[null,"($11,985 plus $5,994 per completed years of service)",null,{"$f":"IF($D$28=\"\",\"\",IF($D31=\"Y\", 0, TFC_Base +(( TFC_eachYOS)*$D$28)))","v":""},null,null,null,null,null,null,null,null,null,null,null,null,null,null,null,null,"Weekly Salary",{"$f":"+AA46","v":0}]
[null,null,null,null,null,null,null,null,null,null,null,null,null,null,null,null,null,null,null,null,"Lve Loading Full Year",{"$f":"V50*4*17.5%","v":0}]
[null,"Taxable Amount",null,{"$f":"IFERROR(IF($D$46-$D$49<0, 0, $D$46-$D$49),\"\")","v":0},null,null,null,null,null,null,null,null,null,null,null,null,null,null,null,null,"Days worked since","2022-12-31",{"$f":"NETWORKDAYS($V$52,$C$22)","v":-32090}]
[null,null,null,null,null,null,null,null,null,null,null,null,null,null,null,null,null,null,null,null,"EA Lve Loading days",260]
[null,"Tax Rate (up to $235K)",{"$f":"Y44","v":0.32},{"$f":"IFERROR(ROUNDUP(IF(D52>235000,235000*C54,D52*C54),0),\" \")","v":0}]
[null,"Tax Rate (after the first $235K)",{"$f":"Y45","v":0.47},{"$f":"IFERROR(ROUNDUP(IF(D52<235000,0,(D52-235000)*C55),0),\" \")","v":0},null,null,null,null,null,null,null,null,null,null,null,null,null,null,null,null,null,{"$f":"W52/V53","v":-123.42307692307692}]
[null,"Total Tax Amount",null,{"$f":"SUM(D54:D55)","v":0},null,null,null,null,null,null,null,null,null,null,null,null,null,null,null,null,"Pro Rata Loading",{"$f":"MIN(((E36*4*17.5%)/V53)*W52,1640.9)","v":0}]
[]
[]
[null,"Leave Details","Balance","Amount"]
[null,"Annual Leave ",{"$f":"G10","v":0},{"$f":"ROUND(C60*$F$36,2)","v":0}]
{"$rows_left_out":44}
{"sheet":"Severance payment","index":1,"n_rows":57,"n_cols":3,"rows_kept":57,"cut":false,"hidden":true,"merged":[[3,1,3,2]]}
[]
["Severance Payments - As per clause 8.8 of ACU Staff Enterprise Agreement 2022-2025"]
[]
[null,"No. of weeks' salary"]
["Completed continuous years of service on Termination","Less than 45 years old","45 years old or older"]
[0,4,5]
[1,4,5]
[2,7,8.75]
[3,10,12.5]
[4,13,16.25]
[5,15,18.75]
[6,17,21.25]
[7,19,23.75]
[8,21,26.25]
[9,23,28.75]
[10,31.25,31.25]
[11,33.75,33.75]
[12,36.25,36.25]
[13,38.75,38.75]
[14,41.25,41.25]
[15,43.75,43.75]
[16,46.25,46.25]
[17,48.75,48.75]
[18,51.25,51.25]
[19,52,52]
[20,52,52]
[21,52,52]
[22,52,52]
[23,52,52]
[24,52,52]
[25,52,52]
[26,52,52]
[27,52,52]
[28,52,52]
[29,52,52]
[30,52,52]
[31,52,52]
[32,52,52]
[33,52,52]
[34,52,52]
[35,52,52]
[36,52,52]
[37,52,52]
[38,52,52]
[39,52,52]
[40,52,52]
[41,52,52]
[42,52,52]
[43,52,52]
[44,52,52]
[45,52,52]
[46,52,52]
[47,52,52]
[48,52,52]
[49,52,52]
[50,52,52]
[51,52,52]

{"sheet":"Notice","index":2,"n_rows":63,"n_cols":2,"rows_kept":63,"cut":false,"hidden":true,"merged":[[9,0,10,0]]}
["Notice Period - As per clause 8.6 of ACU Staff Enterprise Agreement 2022-2025"]
[]
["Completed years of service at the end of the day when notice is given","Period of Notice"]
["Professional Staff less than or equal to 5 years of service","3 weeks per year of service"]
["Professional Staff more than 5 years of service","26 weeks"]
["Academic Staff","26 weeks"]
[]
[]
["Interpretation of above provision in relation to Professional staff"]
["Completed years of service at the end of the day when notice is given","Period of Notice"]
[null,"(weeks)"]
[0,3]
[1,3]
[2,6]
[3,9]
[4,12]
[5,26]
[6,26]
[7,26]
[8,26]
[9,26]
[10,26]
[11,26]
[12,26]
[13,26]
[14,26]
[15,26]
[16,26]
[17,26]
[18,26]
[19,26]
[20,26]
[21,26]
[22,26]
[23,26]
[24,26]
[25,26]
[26,26]
[27,26]
[28,26]
[29,26]
[30,26]
[31,26]
[32,26]
[33,26]
[34,26]
[35,26]
[36,26]
[37,26]
[38,26]
[39,26]
[40,26]
[41,26]
[42,26]
[43,26]
[44,26]
[45,26]
[46,26]
[47,26]
[48,26]
{"$rows_left_out":4}
{"sheet":"Salary Rate","index":3,"n_rows":72,"n_cols":11,"rows_kept":72,"cut":false,"hidden":true,"merged":[[2,8,3,8],[2,10,3,10],[2,0,3,0],[2,2,3,2],[2,3,3,3],[2,4,3,4],[2,5,3,5],[2,6,3,6],[2,7,3,7]]}
["ACADEMIC STAFF SALARY RATES EFFECTIVE 07 JANUARY 2023"]
["Updated 23 November 2022"]
["PAY CLASS","SALARY RATES","2.2% increase 09/07/2022","2.8% increase (+cost of living $) 07/01/2023","F/N Salary","Hourly Rate","Casual Hourly Rate With 25% Loading","Super @17%","Annual leave loading","Total Rem","Total Rem"]
[null,null,null,null,null,null,null,null,null,"(2 d.p)"]
["ACA1","Academic Level A, Increment 1",72009,75053,2876.77,41.096780000000003,51.370980000000003,12759.01,{"$f":"MIN(D5/52.17858*4*0.175,1640.9)","v":1006.8710187207088},{"$f":"SUM(D5,H5:I5)","v":88818.881018720698},{"$f":"ROUNDDOWN(J5,0)","v":88818}]
["ACA2","Academic Level A, Increment 2",76121,79280,3038.79,43.411349999999999,54.264189999999999,13477.6,{"$f":"MIN(D6/52.17858*4*0.175,1640.9)","v":1063.5781962636775},{"$f":"SUM(D6,H6:I6)","v":93821.178196263689},{"$f":"ROUNDDOWN(J6,0)","v":93821}]
["ACA3","Academic Level A, Increment 3",80234,83509,3200.89,45.727029999999999,57.158790000000003,14196.53,1120.3122047399527,98825.842204739951,98825]
["ACA4","Academic Level A, Increment 4",84347,87737,3362.95,48.042160000000003,60.052700000000002,14915.29,1177.0327977495745,103829.32279774958,103829]
["ACA5","Academic Level A, Increment 5",87693,91176,3494.77,49.925249999999998,62.406559999999999,15499.92,1223.1685875698417,107899.08858756984,107899]
["ACA6","Academic Level A, Increment 6",91034,94611,3626.43,51.806150000000002,64.757689999999997,16083.87,1269.2507155234964,111964.12071552349,111964]
["ACA7","Academic Level A, Increment 7",94381,98052,3758.32,53.690339999999999,67.112930000000006,16668.84,1315.4133362770701,116036.25333627706,116036]
["ACA8","Academic Level A, Increment 8",97722,101486,3889.95,55.570700000000002,69.463380000000001,17252.62,1361.4820487640714,120100.10204876406,120100]
["ACB1","Academic Level B, Increment 1",106728,109716,4205.3999999999996,60.077199999999998,75.096500000000006,18651.72,1471.8913393196979,129839.6113393197,129839]
["ACB2","Academic Level B, Increment 2",110580,113676,4357.1899999999996,62.245570000000001,77.806960000000004,19324.919999999998,1525.0165872662692,134525.93658726625,134525]
["ACB3","Academic Level B, Increment 3",114442,117646,4509.3599999999997,64.419430000000006,80.524289999999993,19999.82,1578.2759898793718,139224.09598987937,139224]
["ACB4","Academic Level B, Increment 4",118298,121610,4661.3,66.59,83.237499999999997,20673.7,1631.454899692556,143915.15489969257,143915]
["ACB5","Academic Level B, Increment 5",122156,125576,4813.32,68.761660000000006,85.952079999999995,21347.919999999998,1640.9,148564.81999999998,148564]
["ACB6","Academic Level B, Increment 6",126011,129539,4965.22,70.93168,88.664599999999993,22021.63,1640.9,153201.53,153201]
["ACC1","Academic Level C, Increment 1",133726,137470,5269.21,75.274460000000005,94.09308,23369.9,1640.9,162480.79999999999,162480]
["ACC2","Academic Level C, Increment 2",137587,141439,5421.34,77.447760000000002,96.809700000000007,24044.63,1640.9,167124.53,167124]
["ACC3","Academic Level C, Increment 3",141437,145397,5573.05,79.615049999999997,99.518810000000002,24717.49,1640.9,171755.38999999998,171755]
["ACC4","Academic Level C, Increment 4",145299,149367,5725.22,81.788899999999998,102.23613,25392.39,1640.9,176400.29,176400]
["ACD1","Academic Level D, Increment 1",151732,155980,5978.7,85.409980000000004,106.76248,26516.6,1640.9,184137.5,184137]
["ACD2","Academic Level D, Increment 2",156869,161261,6181.12,88.301699999999997,110.37712999999999,27414.37,1640.9,190316.27,190316]
["ACD3","Academic Level D, Increment 3",162015,166551,6383.88,91.198340000000002,113.99793,28313.67,1640.9,196505.56999999998,196505]
["ACD4","Academic Level D, Increment 4",167158,171838,6586.53,94.093350000000001,117.61669000000001,29212.46,1640.9,202691.36,202691]
["ACE1","Academic Level E, Increment 1",195450,200923,7701.36,110.01942,137.52428,34156.910000000003,1640.9,236720.81,236720]
[]
[]
["PROFESSIONAL STAFF SALARY RATES AS AT 7 JANUARY 2023 (leave loading cap updated effective 02/09/2023)"]
["Updated 23 November 2022"]
["PAY CLASS","SALARY RATES","2.2% increase 09/07/2022","2.8% increase (+cost of living $) 07/01/2023","F/N AMOUNT","HOURLY RATE","CASUAL HOURLY RATE WITH 25% LOADING","Super @17%","Annual leave loading","Total Rem (2 d.p)","Total Rem"]
["HEW11","HEW 1 Increment 1",52506,55004,2108.3000000000002,30.118539999999999,37.648180000000004,9350.68,{"$f":"MIN(D33/52.17858*4*0.175,1640.9)","v":737.90432779121249},{"$f":"SUM(D33,H33:I33)","v":65092.584327791214},{"$f":"ROUNDDOWN(J33,0)","v":65092}]
["HEW12","HEW 1 Increment 2",53750,56283,2157.3200000000002,30.81889,38.523609999999998,9568.11,{"$f":"MIN(D34/52.17858*4*0.175,1640.9)","v":755.06270964062253},{"$f":"SUM(D34,H34:I34)","v":66606.172709640625},{"$f":"ROUNDDOWN(J34,0)","v":66606}]
["HEW13","HEW 1 Increment 3",55000,57568,2206.58,31.52251,39.40314,9786.56,{"$f":"MIN(D35/52.17858*4*0.175,1640.9)","v":772.30158428995196},68126.861584289945,68126]
["HEW21","HEW 2 Increment 1",56491,59101,2265.34,32.361939999999997,40.45243,10047.17,792.86749466926847,69941.037494669261,69941]
["HEW22","HEW 2 Increment 2",57742,60387,2314.63,33.066110000000002,41.332639999999998,10265.790000000001,810.11978478525089,71462.909784785254,71462]
["HEW23","HEW 2 Increment 3",59235,61922,2373.46,33.90663,42.383290000000002,10526.74,830.71252609787393,73279.452526097884,73279]
["HEW31","HEW 3 Increment 1",60727,63455,2432.2199999999998,34.74606,43.432580000000002,10787.35,851.27843647719044,75093.6284364772,75093]
["HEW32","HEW 3 Increment 2",62228,64998,2491.37,35.590960000000003,44.488700000000001,11049.66,871.97850152303874,76919.638501523048,76919]
["HEW33","HEW 3 Increment 3",63721,66533,2550.1999999999998,36.431480000000001,45.539349999999999,11310.61,892.57124283566179,78736.181242835664,78736]
["HEW34","HEW 3 Increment 4",65230,68084,2609.65,37.280760000000001,46.600949999999997,11574.28,913.37863161473535,80571.65863161473,80571]
["HEW41","HEW 4 Increment 1",67262,70173,2689.72,38.424630000000001,48.030790000000003,11929.41,941.40354145321703,83043.813541453215,83043]
["HEW42","HEW 4 Increment 2",69024,71985,2759.18,39.416829999999997,49.271039999999999,12237.45,965.71236702876922,85188.162367028766,85188]
["HEW43","HEW 4 Increment 3",70807,73818,2829.44,40.420529999999999,50.525660000000002,12549.06,990.30291740403811,87357.36291740404,87357]
["HEW44","HEW 4 Increment 4",72843,75911,2909.66,41.566589999999998,51.958240000000004,12904.87,1018.3814891091325,89834.251489109127,89834]
["HEW51","HEW 5 Increment 1",74922,78048,2991.57,42.736750000000001,53.420940000000002,13268.16,1047.0503413469664,92363.210341346974,92363]
["HEW52","HEW 5 Increment 2",77005,80189,3073.64,43.909100000000002,54.886380000000003,13632.13,1075.7728554514133,94896.902855451423,94896]
["HEW53","HEW 5 Increment 3",79104,82347,3156.35,45.09075,56.363439999999997,13998.99,1104.7234324889639,97450.713432488963,97450]
["HEW54","HEW 5 Increment 4",81188,84489,3238.46,46.263649999999998,57.829560000000001,14363.13,1133.4593620600638,99985.589362060069,99985]
["HEW61","HEW 6 Increment 1",83773,86633,3320.63,47.437640000000002,59.297049999999999,14727.61,1162.2221225644698,102522.83212256448,102522]
["HEW62","HEW 6 Increment 2",85854,88772,3402.62,48.608890000000002,60.761110000000002,15091.24,1190.9178057356103,105054.15780573561,105054]
["HEW63","HEW 6 Increment 3",87937,90913,3484.69,49.781239999999997,62.226550000000003,15455.21,1219.6403198400571,107587.85031984004,107587]
["HEW64","HEW 6 Increment 4",90022,93057,3566.87,50.95523,63.694040000000001,15819.69,1248.4030803444632,110125.09308034446,110125]
["HEW71","HEW 7 Increment 1",92665,95774,3671.01,52.442979999999999,65.553730000000002,16281.58,1284.8529032411384,113340.43290324113,113340]
["HEW72","HEW 7 Increment 2",95206,98386,3771.13,53.87323,67.341539999999995,16725.62,1319.8941021392304,116431.51410213922,116431]
["HEW73","HEW 7 Increment 3",97751,101002,3871.4,55.305669999999999,69.132090000000005,17170.34,1354.9889629039349,119527.32896290394,119527]
["HEW74","HEW 7 Increment 4",100290,103612,3971.44,56.734830000000002,70.918539999999993,17614.04,1390.0033308687205,122616.04333086874,122616]
["HEW81","HEW 8 Increment 1",103343,106237,4072.05,58.172199999999997,72.715249999999997,18060.29,1425.2189308333036,125722.50893083331,125722]
["HEW82","HEW 8 Increment 2",107412,110420,4232.3900000000003,60.462690000000002,75.578360000000004,18771.400000000001,1481.3358278435328,130672.73582784353,130672]
{"$rows_left_out":13}
{"sheet":"Mapping","index":4,"n_rows":42,"n_cols":3,"rows_kept":42,"cut":false,"hidden":true,"merged":[]}
["SALARY RATES"]
["Academic","Professional","Senior Management"]
["Academic Level A, Increment 1","HEW 1 Increment 1"]
["Academic Level A, Increment 2","HEW 1 Increment 2"]
["Academic Level A, Increment 3","HEW 1 Increment 3"]
["Academic Level A, Increment 4","HEW 2 Increment 1"]
["Academic Level A, Increment 5","HEW 2 Increment 2"]
["Academic Level A, Increment 6","HEW 2 Increment 3"]
["Academic Level A, Increment 7","HEW 3 Increment 1"]
["Academic Level A, Increment 8","HEW 3 Increment 2"]
["Academic Level B, Increment 1","HEW 3 Increment 3"]
["Academic Level B, Increment 2","HEW 3 Increment 4"]
["Academic Level B, Increment 3","HEW 4 Increment 1"]
["Academic Level B, Increment 4","HEW 4 Increment 2"]
["Academic Level B, Increment 5","HEW 4 Increment 3"]
["Academic Level B, Increment 6","HEW 4 Increment 4"]
["Academic Level C, Increment 1","HEW 5 Increment 1"]
["Academic Level C, Increment 2","HEW 5 Increment 2"]
["Academic Level C, Increment 3","HEW 5 Increment 3"]
["Academic Level C, Increment 4","HEW 5 Increment 4"]
["Academic Level D, Increment 1","HEW 6 Increment 1"]
["Academic Level D, Increment 2","HEW 6 Increment 2"]
["Academic Level D, Increment 3","HEW 6 Increment 3"]
["Academic Level D, Increment 4","HEW 6 Increment 4"]
["Academic Level E, Increment 1","HEW 7 Increment 1"]
[null,"HEW 7 Increment 2"]
[null,"HEW 7 Increment 3"]
[null,"HEW 7 Increment 4"]
[null,"HEW 8 Increment 1"]
[null,"HEW 8 Increment 2"]
[null,"HEW 8 Increment 3"]
[null,"HEW 8 Increment 4"]
[null,"HEW 9 Increment 1"]
[null,"HEW 9 Increment 2"]
[null,"HEW 9 Increment 3"]
[null,"HEW 10 Base 0 Min"]
[null,"HEW 10 Base 1"]
[null,"HEW 10 Base 2"]
[null,"HEW 10 Base 3"]
[null,"HEW 10 Base 4"]
[null,"HEW 10 Base 5"]
[null,"HEW 10 Base 6"]

{"sheet":"Tax Rates","index":5,"n_rows":13021,"n_cols":3,"rows_kept":13021,"cut":false,"hidden":true,"merged":[]}
["Tax Table frm 13 Oct 2020"]
["Fortnightly earnings","With tax‑free threshold","No tax‑free threshold"]
[2,0,0]
[4,0,0]
[6,0,2]
[8,0,2]
[10,0,2]
[12,0,2]
[14,0,2]
[16,0,4]
[18,0,4]
[20,0,4]
[22,0,4]
[24,0,4]
[26,0,4]
[28,0,6]
[30,0,6]
[32,0,6]
[34,0,6]
[36,0,6]
[38,0,8]
[40,0,8]
[42,0,8]
[44,0,8]
[46,0,8]
[48,0,10]
[50,0,10]
[52,0,10]
[54,0,10]
[56,0,10]
[58,0,12]
[60,0,12]
[62,0,12]
[64,0,12]
[66,0,12]
[68,0,12]
[70,0,14]
[72,0,14]
[74,0,14]
[76,0,14]
[78,0,14]
[80,0,16]
[82,0,16]
[84,0,16]
[86,0,16]
[88,0,16]
[90,0,18]
[92,0,18]
[94,0,18]
[96,0,18]
[98,0,18]
[100,0,18]
[102,0,20]
[104,0,20]
[106,0,20]
[108,0,20]
[110,0,20]
[112,0,22]
[114,0,22]
[116,0,22]
{"$rows_left_out":12961}